Les avertissements suivants se sont produits :
Warning [2] Undefined array key 0 - Line: 1677 - File: showthread.php PHP 8.5.12 (Linux)
File Line Function
/inc/class_error.php 157 errorHandler->error
/showthread.php 1677 errorHandler->error_callback
/showthread.php 916 buildtree




Installation de Crème 1.2 sous Linux
#7
Merci !
Alors pour info maintenant, là où ça bloque c'est l'intstallation de setuptools... J'arrive pas à trouver ce qui manque pour le moment

Cette fois-ci j'ai tout effacé, j'ai tout recommencé
Code :
Running command /home/www/sites/creme/bin/python -c "import setuptools;__file__='/home/www/sites/creme/build/distribute/setup.py';exec(compile(open(__file__).read().replace('\r\n', '\n'), __file__, 'exec'))" install --record /tmp/pip-r6s9MU-record/install-record.txt --single-version-externally-managed --install-headers /home/www/sites/creme/include/site/python2.6 Before install bootstrap. Scanning installed packages Setuptools installation detected at /home/www/sites/creme/lib/python2.6/site-packages/setuptools-0.6c11-py2.6.egg Egg installation Patching... Renaming /home/www/sites/creme/lib/python2.6/site-packages/setuptools-0.6c11-py2.6.egg into /home/www/sites/creme/lib/python2.6/site-packages/setuptools-0.6c11-py2.6.egg.OLD.1346863707.7 Patched done. Relaunching... Traceback (most recent call last): File "<string>", line 1, in <module> NameError: name 'install' is not defined Complete output from command /home/www/sites/creme/bin/python -c "import setuptools;__file__='/home/www/sites/creme/build/distribute/setup.py';exec(compile(open(__file__).read().replace('\r\n', '\n'), __file__, 'exec'))" install --record /tmp/pip-r6s9MU-record/install-record.txt --single-version-externally-managed --install-headers /home/www/sites/creme/include/site/python2.6: Before install bootstrap. Scanning installed packages Setuptools installation detected at /home/www/sites/creme/lib/python2.6/site-packages/setuptools-0.6c11-py2.6.egg Egg installation Patching... Renaming /home/www/sites/creme/lib/python2.6/site-packages/setuptools-0.6c11-py2.6.egg into /home/www/sites/creme/lib/python2.6/site-packages/setuptools-0.6c11-py2.6.egg.OLD.1346863707.7 Patched done. Relaunching... Traceback (most recent call last): File "<string>", line 1, in <module> NameError: name 'install' is not defined ---------------------------------------- Command /home/www/sites/creme/bin/python -c "import setuptools;__file__='/home/www/sites/creme/build/distribute/setup.py';exec(compile(open(__file__).read().replace('\r\n', '\n'), __file__, 'exec'))" install --record /tmp/pip-r6s9MU-record/install-record.txt --single-version-externally-managed --install-headers /home/www/sites/creme/include/site/python2.6 failed with error code 1 in /home/www/sites/creme/build/distribute Exception information: Traceback (most recent call last): File "/home/www/sites/creme/lib/python2.6/site-packages/pip-1.2-py2.6.egg/pip/basecommand.py", line 106, in main status = self.run(options, args) File "/home/www/sites/creme/lib/python2.6/site-packages/pip-1.2-py2.6.egg/pip/commands/install.py", line 261, in run requirement_set.install(install_options, global_options) File "/home/www/sites/creme/lib/python2.6/site-packages/pip-1.2-py2.6.egg/pip/req.py", line 1166, in install requirement.install(install_options, global_options) File "/home/www/sites/creme/lib/python2.6/site-packages/pip-1.2-py2.6.egg/pip/req.py", line 589, in install cwd=self.source_dir, filter_stdout=self._filter_install, show_stdout=False) File "/home/www/sites/creme/lib/python2.6/site-packages/pip-1.2-py2.6.egg/pip/util.py", line 612, in call_subprocess % (command_desc, proc.returncode, cwd)) InstallationError: Command /home/www/sites/creme/bin/python -c "import setuptools;__file__='/home/www/sites/creme/build/distribute/setup.py';exec(compile(open(__file__).read().replace('\r\n', '\n'), __file__, 'exec'))" install --record /tmp/pip-r6s9MU-record/install-record.txt --single-version-externally-managed --install-headers /home/www/sites/creme/include/site/python2.6 failed with error code 1 in /home/www/sites/creme/build/distribute
  Répondre


Messages dans ce sujet

Atteindre :


Utilisateur(s) parcourant ce sujet : 1 visiteur(s)